From Botched Eider, 2 Years ago, written in Plain Text.
  1. mdgronke@bn19-94 cgi-bin]$ pip install pillow
  2. You are using pip version 7.1.0, however version 8.1.2 is available.
  3. You should consider upgrading via the 'pip install --upgrade pip' command.
  4. Collecting pillow
  5.   Using cached Pillow-3.3.0.zip
  6. Installing collected packages: pillow
  7.   Running setup.py install for pillow
  8.     Complete output from command /usr/bin/python -c "import setuptools, tokenize;__file__='/tmp/pip-build-MF_sXC/pillow/setup.py';exec(compile(getattr(tokenize, 'open', open)(__file__).read().replace('rn', 'n'), __file__, 'exec'))" install --record /tmp/pip-HIqeEv-record/install-record.txt --single-version-externally-managed --compile:
  9.     running install
  10.     running build
  11.     running build_py
  12.     creating build
  13.     creating build/lib.linux-x86_64-2.7
  14.     creating build/lib.linux-x86_64-2.7/PIL
  15.     copying PIL/ImageGrab.py -> build/lib.linux-x86_64-2.7/PIL
  16.     copying PIL/TiffImagePlugin.py -> build/lib.linux-x86_64-2.7/PIL
  17.     copying PIL/MicImagePlugin.py -> build/lib.linux-x86_64-2.7/PIL
  18.     copying PIL/FitsStubImagePlugin.py -> build/lib.linux-x86_64-2.7/PIL
  19.     copying PIL/ExifTags.py -> build/lib.linux-x86_64-2.7/PIL
  20.     copying PIL/ImageChops.py -> build/lib.linux-x86_64-2.7/PIL
  21.     copying PIL/CurImagePlugin.py -> build/lib.linux-x86_64-2.7/PIL
  22.     copying PIL/ImageEnhance.py -> build/lib.linux-x86_64-2.7/PIL
  23.     copying PIL/WebPImagePlugin.py -> build/lib.linux-x86_64-2.7/PIL
  24.     copying PIL/PngImagePlugin.py -> build/lib.linux-x86_64-2.7/PIL
  25.     copying PIL/DcxImagePlugin.py -> build/lib.linux-x86_64-2.7/PIL
  26.     copying PIL/TgaImagePlugin.py -> build/lib.linux-x86_64-2.7/PIL
  27.     copying PIL/PsdImagePlugin.py -> build/lib.linux-x86_64-2.7/PIL
  28.     copying PIL/JpegPresets.py -> build/lib.linux-x86_64-2.7/PIL
  29.     copying PIL/GimpPaletteFile.py -> build/lib.linux-x86_64-2.7/PIL
  30.     copying PIL/GbrImagePlugin.py -> build/lib.linux-x86_64-2.7/PIL
  31.     copying PIL/OleFileIO.py -> build/lib.linux-x86_64-2.7/PIL
  32.     copying PIL/PSDraw.py -> build/lib.linux-x86_64-2.7/PIL
  33.     copying PIL/_binary.py -> build/lib.linux-x86_64-2.7/PIL
  34.     copying PIL/ImageSequence.py -> build/lib.linux-x86_64-2.7/PIL
  35.     copying PIL/DdsImagePlugin.py -> build/lib.linux-x86_64-2.7/PIL
  36.     copying PIL/McIdasImagePlugin.py -> build/lib.linux-x86_64-2.7/PIL
  37.     copying PIL/IptcImagePlugin.py -> build/lib.linux-x86_64-2.7/PIL
  38.     copying PIL/ImageTransform.py -> build/lib.linux-x86_64-2.7/PIL
  39.     copying PIL/PdfImagePlugin.py -> build/lib.linux-x86_64-2.7/PIL
  40.     copying PIL/JpegImagePlugin.py -> build/lib.linux-x86_64-2.7/PIL
  41.     copying PIL/FontFile.py -> build/lib.linux-x86_64-2.7/PIL
  42.     copying PIL/Hdf5StubImagePlugin.py -> build/lib.linux-x86_64-2.7/PIL
  43.     copying PIL/PcxImagePlugin.py -> build/lib.linux-x86_64-2.7/PIL
  44.     copying PIL/WalImageFile.py -> build/lib.linux-x86_64-2.7/PIL
  45.     copying PIL/ImageQt.py -> build/lib.linux-x86_64-2.7/PIL
  46.     copying PIL/ImageFile.py -> build/lib.linux-x86_64-2.7/PIL
  47.     copying PIL/IcnsImagePlugin.py -> build/lib.linux-x86_64-2.7/PIL
  48.     copying PIL/BufrStubImagePlugin.py -> build/lib.linux-x86_64-2.7/PIL
  49.     copying PIL/EpsImagePlugin.py -> build/lib.linux-x86_64-2.7/PIL
  50.     copying PIL/TiffTags.py -> build/lib.linux-x86_64-2.7/PIL
  51.     copying PIL/BmpImagePlugin.py -> build/lib.linux-x86_64-2.7/PIL
  52.     copying PIL/MpoImagePlugin.py -> build/lib.linux-x86_64-2.7/PIL
  53.     copying PIL/GimpGradientFile.py -> build/lib.linux-x86_64-2.7/PIL
  54.     copying PIL/SgiImagePlugin.py -> build/lib.linux-x86_64-2.7/PIL
  55.     copying PIL/ImageCms.py -> build/lib.linux-x86_64-2.7/PIL
  56.     copying PIL/ImageDraw2.py -> build/lib.linux-x86_64-2.7/PIL
  57.     copying PIL/ImageStat.py -> build/lib.linux-x86_64-2.7/PIL
  58.     copying PIL/_tkinter_finder.py -> build/lib.linux-x86_64-2.7/PIL
  59.     copying PIL/SpiderImagePlugin.py -> build/lib.linux-x86_64-2.7/PIL
  60.     copying PIL/ImageWin.py -> build/lib.linux-x86_64-2.7/PIL
  61.     copying PIL/Jpeg2KImagePlugin.py -> build/lib.linux-x86_64-2.7/PIL
  62.     copying PIL/__init__.py -> build/lib.linux-x86_64-2.7/PIL
  63.     copying PIL/ImagePalette.py -> build/lib.linux-x86_64-2.7/PIL
  64.     copying PIL/FtexImagePlugin.py -> build/lib.linux-x86_64-2.7/PIL
  65.     copying PIL/Image.py -> build/lib.linux-x86_64-2.7/PIL
  66.     copying PIL/SunImagePlugin.py -> build/lib.linux-x86_64-2.7/PIL
  67.     copying PIL/ImageFont.py -> build/lib.linux-x86_64-2.7/PIL
  68.     copying PIL/ImageTk.py -> build/lib.linux-x86_64-2.7/PIL
  69.     copying PIL/TarIO.py -> build/lib.linux-x86_64-2.7/PIL
  70.     copying PIL/ImageShow.py -> build/lib.linux-x86_64-2.7/PIL
  71.     copying PIL/PpmImagePlugin.py -> build/lib.linux-x86_64-2.7/PIL
  72.     copying PIL/XpmImagePlugin.py -> build/lib.linux-x86_64-2.7/PIL
  73.     copying PIL/ImageColor.py -> build/lib.linux-x86_64-2.7/PIL
  74.     copying PIL/PyAccess.py -> build/lib.linux-x86_64-2.7/PIL
  75.     copying PIL/GifImagePlugin.py -> build/lib.linux-x86_64-2.7/PIL
  76.     copying PIL/ImagePath.py -> build/lib.linux-x86_64-2.7/PIL
  77.     copying PIL/ImageFilter.py -> build/lib.linux-x86_64-2.7/PIL
  78.     copying PIL/ImageMode.py -> build/lib.linux-x86_64-2.7/PIL
  79.     copying PIL/features.py -> build/lib.linux-x86_64-2.7/PIL
  80.     copying PIL/GdImageFile.py -> build/lib.linux-x86_64-2.7/PIL
  81.     copying PIL/ContainerIO.py -> build/lib.linux-x86_64-2.7/PIL
  82.     copying PIL/MspImagePlugin.py -> build/lib.linux-x86_64-2.7/PIL
  83.     copying PIL/PalmImagePlugin.py -> build/lib.linux-x86_64-2.7/PIL
  84.     copying PIL/ImageMath.py -> build/lib.linux-x86_64-2.7/PIL
  85.     copying PIL/FliImagePlugin.py -> build/lib.linux-x86_64-2.7/PIL
  86.     copying PIL/MpegImagePlugin.py -> build/lib.linux-x86_64-2.7/PIL
  87.     copying PIL/PcfFontFile.py -> build/lib.linux-x86_64-2.7/PIL
  88.     copying PIL/XbmImagePlugin.py -> build/lib.linux-x86_64-2.7/PIL
  89.     copying PIL/ImageOps.py -> build/lib.linux-x86_64-2.7/PIL
  90.     copying PIL/ImageDraw.py -> build/lib.linux-x86_64-2.7/PIL
  91.     copying PIL/PixarImagePlugin.py -> build/lib.linux-x86_64-2.7/PIL
  92.     copying PIL/BdfFontFile.py -> build/lib.linux-x86_64-2.7/PIL
  93.     copying PIL/FpxImagePlugin.py -> build/lib.linux-x86_64-2.7/PIL
  94.     copying PIL/ImImagePlugin.py -> build/lib.linux-x86_64-2.7/PIL
  95.     copying PIL/IcoImagePlugin.py -> build/lib.linux-x86_64-2.7/PIL
  96.     copying PIL/ImtImagePlugin.py -> build/lib.linux-x86_64-2.7/PIL
  97.     copying PIL/PcdImagePlugin.py -> build/lib.linux-x86_64-2.7/PIL
  98.     copying PIL/PaletteFile.py -> build/lib.linux-x86_64-2.7/PIL
  99.     copying PIL/_util.py -> build/lib.linux-x86_64-2.7/PIL
  100.     copying PIL/ImageMorph.py -> build/lib.linux-x86_64-2.7/PIL
  101.     copying PIL/XVThumbImagePlugin.py -> build/lib.linux-x86_64-2.7/PIL
  102.     copying PIL/WmfImagePlugin.py -> build/lib.linux-x86_64-2.7/PIL
  103.     copying PIL/GribStubImagePlugin.py -> build/lib.linux-x86_64-2.7/PIL
  104.     running egg_info
  105.     writing Pillow.egg-info/PKG-INFO
  106.     writing top-level names to Pillow.egg-info/top_level.txt
  107.     writing dependency_links to Pillow.egg-info/dependency_links.txt
  108.     warning: manifest_maker: standard file '-c' not found
  109.    
  110.     reading manifest file 'Pillow.egg-info/SOURCES.txt'
  111.     reading manifest template 'MANIFEST.in'
  112.     warning: no files found matching '*.sh'
  113.     no previously-included directories found matching 'docs/_static'
  114.     warning: no previously-included files found matching '.coveragerc'
  115.     warning: no previously-included files found matching '.editorconfig'
  116.     warning: no previously-included files found matching '.landscape.yaml'
  117.     warning: no previously-included files found matching 'appveyor.yml'
  118.     warning: no previously-included files found matching 'build_children.sh'
  119.     warning: no previously-included files found matching 'tox.ini'
  120.     warning: no previously-included files matching '.git*' found anywhere in distribution
  121.     warning: no previously-included files matching '*.pyc' found anywhere in distribution
  122.     warning: no previously-included files matching '*.so' found anywhere in distribution
  123.     writing manifest file 'Pillow.egg-info/SOURCES.txt'
  124.     copying PIL/OleFileIO-README.md -> build/lib.linux-x86_64-2.7/PIL
  125.     running build_ext
  126.     building 'PIL._imaging' extension
  127.     creating build/temp.linux-x86_64-2.7/libImaging
  128.     gcc -pthread -fno-strict-aliasing -O2 -g -pipe -Wall -Wp,-D_FORTIFY_SOURCE=2 -fexceptions -fstack-protector-strong --param=ssp-buffer-size=4 -grecord-gcc-switches -m64 -mtune=generic -D_GNU_SOURCE -fPIC -fwrapv -DNDEBUG -O2 -g -pipe -Wall -Wp,-D_FORTIFY_SOURCE=2 -fexceptions -fstack-protector-strong --param=ssp-buffer-size=4 -grecord-gcc-switches -m64 -mtune=generic -D_GNU_SOURCE -fPIC -fwrapv -fPIC -DHAVE_LIBJPEG -DHAVE_LIBZ -I/tmp/pip-build-MF_sXC/pillow/libImaging -I/usr/include -I/usr/local/include -I/usr/include/python2.7 -c _imaging.c -o build/temp.linux-x86_64-2.7/_imaging.o
  129.     gcc -pthread -fno-strict-aliasing -O2 -g -pipe -Wall -Wp,-D_FORTIFY_SOURCE=2 -fexceptions -fstack-protector-strong --param=ssp-buffer-size=4 -grecord-gcc-switches -m64 -mtune=generic -D_GNU_SOURCE -fPIC -fwrapv -DNDEBUG -O2 -g -pipe -Wall -Wp,-D_FORTIFY_SOURCE=2 -fexceptions -fstack-protector-strong --param=ssp-buffer-size=4 -grecord-gcc-switches -m64 -mtune=generic -D_GNU_SOURCE -fPIC -fwrapv -fPIC -DHAVE_LIBJPEG -DHAVE_LIBZ -I/tmp/pip-build-MF_sXC/pillow/libImaging -I/usr/include -I/usr/local/include -I/usr/include/python2.7 -c libImaging/Resample.c -o build/temp.linux-x86_64-2.7/libImaging/Resample.o
  130.     _imaging.c:76:20: fatal error: Python.h: No such file or directory
  131.      #include "Python.h"
  132.                         ^
  133.     compilation terminated.
  134.     gcc -pthread -fno-strict-aliasing -O2 -g -pipe -Wall -Wp,-D_FORTIFY_SOURCE=2 -fexceptions -fstack-protector-strong --param=ssp-buffer-size=4 -grecord-gcc-switches -m64 -mtune=generic -D_GNU_SOURCE -fPIC -fwrapv -DNDEBUG -O2 -g -pipe -Wall -Wp,-D_FORTIFY_SOURCE=2 -fexceptions -fstack-protector-strong --param=ssp-buffer-size=4 -grecord-gcc-switches -m64 -mtune=generic -D_GNU_SOURCE -fPIC -fwrapv -fPIC -DHAVE_LIBJPEG -DHAVE_LIBZ -I/tmp/pip-build-MF_sXC/pillow/libImaging -I/usr/include -I/usr/local/include -I/usr/include/python2.7 -c libImaging/Crop.c -o build/temp.linux-x86_64-2.7/libImaging/Crop.o
  135.     In file included from libImaging/Imaging.h:14:0,
  136.                      from libImaging/Resample.c:1:
  137.     libImaging/ImPlatform.h:10:20: fatal error: Python.h: No such file or directory
  138.      #include "Python.h"
  139.                         ^
  140.     compilation terminated.
  141.     In file included from libImaging/Imaging.h:14:0,
  142.                      from libImaging/Crop.c:19:
  143.     libImaging/ImPlatform.h:10:20: fatal error: Python.h: No such file or directory
  144.      #include "Python.h"
  145.                         ^
  146.     compilation terminated.
  147.     gcc -pthread -fno-strict-aliasing -O2 -g -pipe -Wall -Wp,-D_FORTIFY_SOURCE=2 -fexceptions -fstack-protector-strong --param=ssp-buffer-size=4 -grecord-gcc-switches -m64 -mtune=generic -D_GNU_SOURCE -fPIC -fwrapv -DNDEBUG -O2 -g -pipe -Wall -Wp,-D_FORTIFY_SOURCE=2 -fexceptions -fstack-protector-strong --param=ssp-buffer-size=4 -grecord-gcc-switches -m64 -mtune=generic -D_GNU_SOURCE -fPIC -fwrapv -fPIC -DHAVE_LIBJPEG -DHAVE_LIBZ -I/tmp/pip-build-MF_sXC/pillow/libImaging -I/usr/include -I/usr/local/include -I/usr/include/python2.7 -c libImaging/Geometry.c -o build/temp.linux-x86_64-2.7/libImaging/Geometry.o
  148.     In file included from libImaging/Imaging.h:14:0,
  149.                      from libImaging/Geometry.c:1:
  150.     libImaging/ImPlatform.h:10:20: fatal error: Python.h: No such file or directory
  151.      #include "Python.h"
  152.                         ^
  153.     compilation terminated.
  154.     gcc -pthread -fno-strict-aliasing -O2 -g -pipe -Wall -Wp,-D_FORTIFY_SOURCE=2 -fexceptions -fstack-protector-strong --param=ssp-buffer-size=4 -grecord-gcc-switches -m64 -mtune=generic -D_GNU_SOURCE -fPIC -fwrapv -DNDEBUG -O2 -g -pipe -Wall -Wp,-D_FORTIFY_SOURCE=2 -fexceptions -fstack-protector-strong --param=ssp-buffer-size=4 -grecord-gcc-switches -m64 -mtune=generic -D_GNU_SOURCE -fPIC -fwrapv -fPIC -DHAVE_LIBJPEG -DHAVE_LIBZ -I/tmp/pip-build-MF_sXC/pillow/libImaging -I/usr/include -I/usr/local/include -I/usr/include/python2.7 -c libImaging/Matrix.c -o build/temp.linux-x86_64-2.7/libImaging/Matrix.o
  155.     In file included from libImaging/Imaging.h:14:0,
  156.                      from libImaging/Matrix.c:17:
  157.     libImaging/ImPlatform.h:10:20: fatal error: Python.h: No such file or directory
  158.      #include "Python.h"
  159.                         ^
  160.     compilation terminated.
  161.     gcc -pthread -fno-strict-aliasing -O2 -g -pipe -Wall -Wp,-D_FORTIFY_SOURCE=2 -fexceptions -fstack-protector-strong --param=ssp-buffer-size=4 -grecord-gcc-switches -m64 -mtune=generic -D_GNU_SOURCE -fPIC -fwrapv -DNDEBUG -O2 -g -pipe -Wall -Wp,-D_FORTIFY_SOURCE=2 -fexceptions -fstack-protector-strong --param=ssp-buffer-size=4 -grecord-gcc-switches -m64 -mtune=generic -D_GNU_SOURCE -fPIC -fwrapv -fPIC -DHAVE_LIBJPEG -DHAVE_LIBZ -I/tmp/pip-build-MF_sXC/pillow/libImaging -I/usr/include -I/usr/local/include -I/usr/include/python2.7 -c libImaging/Quant.c -o build/temp.linux-x86_64-2.7/libImaging/Quant.o
  162.     In file included from libImaging/Imaging.h:14:0,
  163.                      from libImaging/Quant.c:21:
  164.     libImaging/ImPlatform.h:10:20: fatal error: Python.h: No such file or directory
  165.      #include "Python.h"
  166.                         ^
  167.     compilation terminated.
  168.     gcc -pthread -fno-strict-aliasing -O2 -g -pipe -Wall -Wp,-D_FORTIFY_SOURCE=2 -fexceptions -fstack-protector-strong --param=ssp-buffer-size=4 -grecord-gcc-switches -m64 -mtune=generic -D_GNU_SOURCE -fPIC -fwrapv -DNDEBUG -O2 -g -pipe -Wall -Wp,-D_FORTIFY_SOURCE=2 -fexceptions -fstack-protector-strong --param=ssp-buffer-size=4 -grecord-gcc-switches -m64 -mtune=generic -D_GNU_SOURCE -fPIC -fwrapv -fPIC -DHAVE_LIBJPEG -DHAVE_LIBZ -I/tmp/pip-build-MF_sXC/pillow/libImaging -I/usr/include -I/usr/local/include -I/usr/include/python2.7 -c libImaging/RawDecode.c -o build/temp.linux-x86_64-2.7/libImaging/RawDecode.o
  169.     In file included from libImaging/Imaging.h:14:0,
  170.                      from libImaging/RawDecode.c:17:
  171.     libImaging/ImPlatform.h:10:20: fatal error: Python.h: No such file or directory
  172.      #include "Python.h"
  173.                         ^
  174.     compilation terminated.
  175.     gcc -pthread -fno-strict-aliasing -O2 -g -pipe -Wall -Wp,-D_FORTIFY_SOURCE=2 -fexceptions -fstack-protector-strong --param=ssp-buffer-size=4 -grecord-gcc-switches -m64 -mtune=generic -D_GNU_SOURCE -fPIC -fwrapv -DNDEBUG -O2 -g -pipe -Wall -Wp,-D_FORTIFY_SOURCE=2 -fexceptions -fstack-protector-strong --param=ssp-buffer-size=4 -grecord-gcc-switches -m64 -mtune=generic -D_GNU_SOURCE -fPIC -fwrapv -fPIC -DHAVE_LIBJPEG -DHAVE_LIBZ -I/tmp/pip-build-MF_sXC/pillow/libImaging -I/usr/include -I/usr/local/include -I/usr/include/python2.7 -c libImaging/XbmEncode.c -o build/temp.linux-x86_64-2.7/libImaging/XbmEncode.o
  176.     In file included from libImaging/Imaging.h:14:0,
  177.                      from libImaging/XbmEncode.c:17:
  178.     libImaging/ImPlatform.h:10:20: fatal error: Python.h: No such file or directory
  179.      #include "Python.h"
  180.                         ^
  181.     compilation terminated.
  182.     Building using 2 processes
  183.     gcc -pthread -shared -Wl,-z,relro build/temp.linux-x86_64-2.7/_imaging.o build/temp.linux-x86_64-2.7/decode.o build/temp.linux-x86_64-2.7/encode.o build/temp.linux-x86_64-2.7/map.o build/temp.linux-x86_64-2.7/display.o build/temp.linux-x86_64-2.7/outline.o build/temp.linux-x86_64-2.7/path.o build/temp.linux-x86_64-2.7/libImaging/Access.o build/temp.linux-x86_64-2.7/libImaging/AlphaComposite.o build/temp.linux-x86_64-2.7/libImaging/Resample.o build/temp.linux-x86_64-2.7/libImaging/Bands.o build/temp.linux-x86_64-2.7/libImaging/BitDecode.o build/temp.linux-x86_64-2.7/libImaging/Blend.o build/temp.linux-x86_64-2.7/libImaging/Chops.o build/temp.linux-x86_64-2.7/libImaging/Convert.o build/temp.linux-x86_64-2.7/libImaging/ConvertYCbCr.o build/temp.linux-x86_64-2.7/libImaging/Copy.o build/temp.linux-x86_64-2.7/libImaging/Crc32.o build/temp.linux-x86_64-2.7/libImaging/Crop.o build/temp.linux-x86_64-2.7/libImaging/Dib.o build/temp.linux-x86_64-2.7/libImaging/Draw.o build/temp.linux-x86_64-2.7/libImaging/Effects.o build/temp.linux-x86_64-2.7/libImaging/EpsEncode.o build/temp.linux-x86_64-2.7/libImaging/File.o build/temp.linux-x86_64-2.7/libImaging/Fill.o build/temp.linux-x86_64-2.7/libImaging/Filter.o build/temp.linux-x86_64-2.7/libImaging/FliDecode.o build/temp.linux-x86_64-2.7/libImaging/Geometry.o build/temp.linux-x86_64-2.7/libImaging/GetBBox.o build/temp.linux-x86_64-2.7/libImaging/GifDecode.o build/temp.linux-x86_64-2.7/libImaging/GifEncode.o build/temp.linux-x86_64-2.7/libImaging/HexDecode.o build/temp.linux-x86_64-2.7/libImaging/Histo.o build/temp.linux-x86_64-2.7/libImaging/JpegDecode.o build/temp.linux-x86_64-2.7/libImaging/JpegEncode.o build/temp.linux-x86_64-2.7/libImaging/LzwDecode.o build/temp.linux-x86_64-2.7/libImaging/Matrix.o build/temp.linux-x86_64-2.7/libImaging/ModeFilter.o build/temp.linux-x86_64-2.7/libImaging/MspDecode.o build/temp.linux-x86_64-2.7/libImaging/Negative.o build/temp.linux-x86_64-2.7/libImaging/Offset.o build/temp.linux-x86_64-2.7/libImaging/Pack.o build/temp.linux-x86_64-2.7/libImaging/PackDecode.o build/temp.linux-x86_64-2.7/libImaging/Palette.o build/temp.linux-x86_64-2.7/libImaging/Paste.o build/temp.linux-x86_64-2.7/libImaging/Quant.o build/temp.linux-x86_64-2.7/libImaging/QuantOctree.o build/temp.linux-x86_64-2.7/libImaging/QuantHash.o build/temp.linux-x86_64-2.7/libImaging/QuantHeap.o build/temp.linux-x86_64-2.7/libImaging/PcdDecode.o build/temp.linux-x86_64-2.7/libImaging/PcxDecode.o build/temp.linux-x86_64-2.7/libImaging/PcxEncode.o build/temp.linux-x86_64-2.7/libImaging/Point.o build/temp.linux-x86_64-2.7/libImaging/RankFilter.o build/temp.linux-x86_64-2.7/libImaging/RawDecode.o build/temp.linux-x86_64-2.7/libImaging/RawEncode.o build/temp.linux-x86_64-2.7/libImaging/Storage.o build/temp.linux-x86_64-2.7/libImaging/SunRleDecode.o build/temp.linux-x86_64-2.7/libImaging/TgaRleDecode.o build/temp.linux-x86_64-2.7/libImaging/Unpack.o build/temp.linux-x86_64-2.7/libImaging/UnpackYCC.o build/temp.linux-x86_64-2.7/libImaging/UnsharpMask.o build/temp.linux-x86_64-2.7/libImaging/XbmDecode.o build/temp.linux-x86_64-2.7/libImaging/XbmEncode.o build/temp.linux-x86_64-2.7/libImaging/ZipDecode.o build/temp.linux-x86_64-2.7/libImaging/ZipEncode.o build/temp.linux-x86_64-2.7/libImaging/TiffDecode.o build/temp.linux-x86_64-2.7/libImaging/Jpeg2KDecode.o build/temp.linux-x86_64-2.7/libImaging/Jpeg2KEncode.o build/temp.linux-x86_64-2.7/libImaging/BoxBlur.o build/temp.linux-x86_64-2.7/libImaging/QuantPngQuant.o build/temp.linux-x86_64-2.7/libImaging/codec_fd.o -L/usr/lib -L/usr/lib64 -L/usr/local/lib -L/usr/lib64 -ljpeg -lz -lpython2.7 -o build/lib.linux-x86_64-2.7/PIL/_imaging.so
  184.     gcc: error: build/temp.linux-x86_64-2.7/_imaging.o: No such file or directory
  185.     gcc: error: build/temp.linux-x86_64-2.7/decode.o: No such file or directory
  186.     gcc: error: build/temp.linux-x86_64-2.7/encode.o: No such file or directory
  187.     gcc: error: build/temp.linux-x86_64-2.7/map.o: No such file or directory
  188.     gcc: error: build/temp.linux-x86_64-2.7/display.o: No such file or directory
  189.     gcc: error: build/temp.linux-x86_64-2.7/outline.o: No such file or directory
  190.     gcc: error: build/temp.linux-x86_64-2.7/path.o: No such file or directory
  191.     gcc: error: build/temp.linux-x86_64-2.7/libImaging/Access.o: No such file or directory
  192.     gcc: error: build/temp.linux-x86_64-2.7/libImaging/AlphaComposite.o: No such file or directory
  193.     gcc: error: build/temp.linux-x86_64-2.7/libImaging/Resample.o: No such file or directory
  194.     gcc: error: build/temp.linux-x86_64-2.7/libImaging/Bands.o: No such file or directory
  195.     gcc: error: build/temp.linux-x86_64-2.7/libImaging/BitDecode.o: No such file or directory
  196.     gcc: error: build/temp.linux-x86_64-2.7/libImaging/Blend.o: No such file or directory
  197.     gcc: error: build/temp.linux-x86_64-2.7/libImaging/Chops.o: No such file or directory
  198.     gcc: error: build/temp.linux-x86_64-2.7/libImaging/Convert.o: No such file or directory
  199.     gcc: error: build/temp.linux-x86_64-2.7/libImaging/ConvertYCbCr.o: No such file or directory
  200.     gcc: error: build/temp.linux-x86_64-2.7/libImaging/Copy.o: No such file or directory
  201.     gcc: error: build/temp.linux-x86_64-2.7/libImaging/Crc32.o: No such file or directory
  202.     gcc: error: build/temp.linux-x86_64-2.7/libImaging/Crop.o: No such file or directory
  203.     gcc: error: build/temp.linux-x86_64-2.7/libImaging/Dib.o: No such file or directory
  204.     gcc: error: build/temp.linux-x86_64-2.7/libImaging/Draw.o: No such file or directory
  205.     gcc: error: build/temp.linux-x86_64-2.7/libImaging/Effects.o: No such file or directory
  206.     gcc: error: build/temp.linux-x86_64-2.7/libImaging/EpsEncode.o: No such file or directory
  207.     gcc: error: build/temp.linux-x86_64-2.7/libImaging/File.o: No such file or directory
  208.     gcc: error: build/temp.linux-x86_64-2.7/libImaging/Fill.o: No such file or directory
  209.     gcc: error: build/temp.linux-x86_64-2.7/libImaging/Filter.o: No such file or directory
  210.     gcc: error: build/temp.linux-x86_64-2.7/libImaging/FliDecode.o: No such file or directory
  211.     gcc: error: build/temp.linux-x86_64-2.7/libImaging/Geometry.o: No such file or directory
  212.     gcc: error: build/temp.linux-x86_64-2.7/libImaging/GetBBox.o: No such file or directory
  213.     gcc: error: build/temp.linux-x86_64-2.7/libImaging/GifDecode.o: No such file or directory
  214.     gcc: error: build/temp.linux-x86_64-2.7/libImaging/GifEncode.o: No such file or directory
  215.     gcc: error: build/temp.linux-x86_64-2.7/libImaging/HexDecode.o: No such file or directory
  216.     gcc: error: build/temp.linux-x86_64-2.7/libImaging/Histo.o: No such file or directory
  217.     gcc: error: build/temp.linux-x86_64-2.7/libImaging/JpegDecode.o: No such file or directory
  218.     gcc: error: build/temp.linux-x86_64-2.7/libImaging/JpegEncode.o: No such file or directory
  219.     gcc: error: build/temp.linux-x86_64-2.7/libImaging/LzwDecode.o: No such file or directory
  220.     gcc: error: build/temp.linux-x86_64-2.7/libImaging/Matrix.o: No such file or directory
  221.     gcc: error: build/temp.linux-x86_64-2.7/libImaging/ModeFilter.o: No such file or directory
  222.     gcc: error: build/temp.linux-x86_64-2.7/libImaging/MspDecode.o: No such file or directory
  223.     gcc: error: build/temp.linux-x86_64-2.7/libImaging/Negative.o: No such file or directory
  224.     gcc: error: build/temp.linux-x86_64-2.7/libImaging/Offset.o: No such file or directory
  225.     gcc: error: build/temp.linux-x86_64-2.7/libImaging/Pack.o: No such file or directory
  226.     gcc: error: build/temp.linux-x86_64-2.7/libImaging/PackDecode.o: No such file or directory
  227.     gcc: error: build/temp.linux-x86_64-2.7/libImaging/Palette.o: No such file or directory
  228.     gcc: error: build/temp.linux-x86_64-2.7/libImaging/Paste.o: No such file or directory
  229.     gcc: error: build/temp.linux-x86_64-2.7/libImaging/Quant.o: No such file or directory
  230.     gcc: error: build/temp.linux-x86_64-2.7/libImaging/QuantOctree.o: No such file or directory
  231.     gcc: error: build/temp.linux-x86_64-2.7/libImaging/QuantHash.o: No such file or directory
  232.     gcc: error: build/temp.linux-x86_64-2.7/libImaging/QuantHeap.o: No such file or directory
  233.     gcc: error: build/temp.linux-x86_64-2.7/libImaging/PcdDecode.o: No such file or directory
  234.     gcc: error: build/temp.linux-x86_64-2.7/libImaging/PcxDecode.o: No such file or directory
  235.     gcc: error: build/temp.linux-x86_64-2.7/libImaging/PcxEncode.o: No such file or directory
  236.     gcc: error: build/temp.linux-x86_64-2.7/libImaging/Point.o: No such file or directory
  237.     gcc: error: build/temp.linux-x86_64-2.7/libImaging/RankFilter.o: No such file or directory
  238.     gcc: error: build/temp.linux-x86_64-2.7/libImaging/RawDecode.o: No such file or directory
  239.     gcc: error: build/temp.linux-x86_64-2.7/libImaging/RawEncode.o: No such file or directory
  240.     gcc: error: build/temp.linux-x86_64-2.7/libImaging/Storage.o: No such file or directory
  241.     gcc: error: build/temp.linux-x86_64-2.7/libImaging/SunRleDecode.o: No such file or directory
  242.     gcc: error: build/temp.linux-x86_64-2.7/libImaging/TgaRleDecode.o: No such file or directory
  243.     gcc: error: build/temp.linux-x86_64-2.7/libImaging/Unpack.o: No such file or directory
  244.     gcc: error: build/temp.linux-x86_64-2.7/libImaging/UnpackYCC.o: No such file or directory
  245.     gcc: error: build/temp.linux-x86_64-2.7/libImaging/UnsharpMask.o: No such file or directory
  246.     gcc: error: build/temp.linux-x86_64-2.7/libImaging/XbmDecode.o: No such file or directory
  247.     gcc: error: build/temp.linux-x86_64-2.7/libImaging/XbmEncode.o: No such file or directory
  248.     gcc: error: build/temp.linux-x86_64-2.7/libImaging/ZipDecode.o: No such file or directory
  249.     gcc: error: build/temp.linux-x86_64-2.7/libImaging/ZipEncode.o: No such file or directory
  250.     gcc: error: build/temp.linux-x86_64-2.7/libImaging/TiffDecode.o: No such file or directory
  251.     gcc: error: build/temp.linux-x86_64-2.7/libImaging/Jpeg2KDecode.o: No such file or directory
  252.     gcc: error: build/temp.linux-x86_64-2.7/libImaging/Jpeg2KEncode.o: No such file or directory
  253.     gcc: error: build/temp.linux-x86_64-2.7/libImaging/BoxBlur.o: No such file or directory
  254.     gcc: error: build/temp.linux-x86_64-2.7/libImaging/QuantPngQuant.o: No such file or directory
  255.     gcc: error: build/temp.linux-x86_64-2.7/libImaging/codec_fd.o: No such file or directory
  256.     error: command 'gcc' failed with exit status 1
  257.    
  258.     ----------------------------------------
  259. Command "/usr/bin/python -c "import setuptools, tokenize;__file__='/tmp/pip-build-MF_sXC/pillow/setup.py';exec(compile(getattr(tokenize, 'open', open)(__file__).read().replace('rn', 'n'), __file__, 'exec'))" install --record /tmp/pip-HIqeEv-record/install-record.txt --single-version-externally-managed --compile" failed with error code 1 in /tmp/pip-build-MF_sXC/pillow
  260.  
captcha