From Morose Lizard, 3 Months ago, written in Plain Text.
  1. DKMS make.log for vboxhost-4.3.18 for kernel 3.10.0-957.21.3.el7.x86_64 (x86_64)
  2. Fri Jul  5 10:56:55 CEST 2019
  3. make: Entering directory `/usr/src/kernels/3.10.0-957.21.3.el7.x86_64'
  4.   LD      /var/lib/dkms/vboxhost/4.3.18/build/built-in.o
  5.   LD      /var/lib/dkms/vboxhost/4.3.18/build/vboxnetflt/built-in.o
  6.   LD      /var/lib/dkms/vboxhost/4.3.18/build/vboxpci/built-in.o
  7.   LD      /var/lib/dkms/vboxhost/4.3.18/build/vboxnetadp/built-in.o
  8.   CC [M]  /var/lib/dkms/vboxhost/4.3.18/build/vboxnetflt/linux/VBoxNetFlt-linux.o
  9.   LD      /var/lib/dkms/vboxhost/4.3.18/build/vboxdrv/built-in.o
  10.   CC [M]  /var/lib/dkms/vboxhost/4.3.18/build/vboxpci/linux/VBoxPci-linux.o
  11.   CC [M]  /var/lib/dkms/vboxhost/4.3.18/build/vboxnetadp/linux/VBoxNetAdp-linux.o
  12.   CC [M]  /var/lib/dkms/vboxhost/4.3.18/build/vboxdrv/linux/SUPDrv-linux.o
  13. /var/lib/dkms/vboxhost/4.3.18/build/vboxnetadp/linux/VBoxNetAdp-linux.c: In function ‘vboxNetAdpLinuxXmit’:
  14. /var/lib/dkms/vboxhost/4.3.18/build/vboxnetadp/linux/VBoxNetAdp-linux.c:138:12: error: ‘struct net_device’ has no member named ‘trans_start’
  15.      pNetDev->trans_start = jiffies;
  16.             ^
  17. make[2]: *** [/var/lib/dkms/vboxhost/4.3.18/build/vboxnetadp/linux/VBoxNetAdp-linux.o] Error 1
  18. make[1]: *** [/var/lib/dkms/vboxhost/4.3.18/build/vboxnetadp] Error 2
  19. make[1]: *** Waiting for unfinished jobs....
  20.   CC [M]  /var/lib/dkms/vboxhost/4.3.18/build/vboxpci/VBoxPci.o
  21. /var/lib/dkms/vboxhost/4.3.18/build/vboxnetflt/linux/VBoxNetFlt-linux.c: In function ‘vboxNetFltLinuxPacketHandler’:
  22. /var/lib/dkms/vboxhost/4.3.18/build/vboxnetflt/linux/VBoxNetFlt-linux.c:892:9: error: implicit declaration of function ‘vlan_tx_tag_present’ [-Werror=implicit-function-declaration]
  23.          if (vlan_tx_tag_present(pBuf) && skb_headroom(pBuf) >= VLAN_ETH_HLEN)
  24.          ^
  25. /var/lib/dkms/vboxhost/4.3.18/build/vboxnetflt/linux/VBoxNetFlt-linux.c:902:13: error: implicit declaration of function ‘vlan_tx_tag_get’ [-Werror=implicit-function-declaration]
  26.              pVHdr->h_vlan_TCI   = RT_H2N_U16(vlan_tx_tag_get(pBuf));
  27.              ^
  28. cc1: some warnings being treated as errors
  29. make[2]: *** [/var/lib/dkms/vboxhost/4.3.18/build/vboxnetflt/linux/VBoxNetFlt-linux.o] Error 1
  30. make[1]: *** [/var/lib/dkms/vboxhost/4.3.18/build/vboxnetflt] Error 2
  31.   CC [M]  /var/lib/dkms/vboxhost/4.3.18/build/vboxpci/SUPR0IdcClient.o
  32.   CC [M]  /var/lib/dkms/vboxhost/4.3.18/build/vboxdrv/SUPDrv.o
  33.   CC [M]  /var/lib/dkms/vboxhost/4.3.18/build/vboxpci/SUPR0IdcClientComponent.o
  34.   CC [M]  /var/lib/dkms/vboxhost/4.3.18/build/vboxdrv/SUPDrvSem.o
  35.   CC [M]  /var/lib/dkms/vboxhost/4.3.18/build/vboxpci/linux/SUPR0IdcClient-linux.o
  36.   CC [M]  /var/lib/dkms/vboxhost/4.3.18/build/vboxdrv/SUPDrvTracer.o
  37.   CC [M]  /var/lib/dkms/vboxhost/4.3.18/build/vboxdrv/r0drv/alloc-r0drv.o
  38.   LD [M]  /var/lib/dkms/vboxhost/4.3.18/build/vboxpci/vboxpci.o
  39.   CC [M]  /var/lib/dkms/vboxhost/4.3.18/build/vboxdrv/r0drv/initterm-r0drv.o
  40.   CC [M]  /var/lib/dkms/vboxhost/4.3.18/build/vboxdrv/r0drv/memobj-r0drv.o
  41.   CC [M]  /var/lib/dkms/vboxhost/4.3.18/build/vboxdrv/r0drv/mpnotification-r0drv.o
  42.   CC [M]  /var/lib/dkms/vboxhost/4.3.18/build/vboxdrv/r0drv/powernotification-r0drv.o
  43.   CC [M]  /var/lib/dkms/vboxhost/4.3.18/build/vboxdrv/r0drv/linux/assert-r0drv-linux.o
  44.   CC [M]  /var/lib/dkms/vboxhost/4.3.18/build/vboxdrv/r0drv/linux/alloc-r0drv-linux.o
  45.   CC [M]  /var/lib/dkms/vboxhost/4.3.18/build/vboxdrv/r0drv/linux/initterm-r0drv-linux.o
  46.   CC [M]  /var/lib/dkms/vboxhost/4.3.18/build/vboxdrv/r0drv/linux/memobj-r0drv-linux.o
  47.   CC [M]  /var/lib/dkms/vboxhost/4.3.18/build/vboxdrv/r0drv/linux/memuserkernel-r0drv-linux.o
  48.   CC [M]  /var/lib/dkms/vboxhost/4.3.18/build/vboxdrv/r0drv/linux/mp-r0drv-linux.o
  49.   CC [M]  /var/lib/dkms/vboxhost/4.3.18/build/vboxdrv/r0drv/linux/mpnotification-r0drv-linux.o
  50.   CC [M]  /var/lib/dkms/vboxhost/4.3.18/build/vboxdrv/r0drv/linux/process-r0drv-linux.o
  51. /var/lib/dkms/vboxhost/4.3.18/build/vboxdrv/r0drv/linux/memuserkernel-r0drv-linux.o: warning: objtool: .fixup: unexpected end of section
  52.   CC [M]  /var/lib/dkms/vboxhost/4.3.18/build/vboxdrv/r0drv/linux/semevent-r0drv-linux.o
  53.   CC [M]  /var/lib/dkms/vboxhost/4.3.18/build/vboxdrv/r0drv/linux/semeventmulti-r0drv-linux.o
  54.   CC [M]  /var/lib/dkms/vboxhost/4.3.18/build/vboxdrv/r0drv/linux/semfastmutex-r0drv-linux.o
  55.   CC [M]  /var/lib/dkms/vboxhost/4.3.18/build/vboxdrv/r0drv/linux/semmutex-r0drv-linux.o
  56.   CC [M]  /var/lib/dkms/vboxhost/4.3.18/build/vboxdrv/r0drv/linux/spinlock-r0drv-linux.o
  57.   CC [M]  /var/lib/dkms/vboxhost/4.3.18/build/vboxdrv/r0drv/linux/thread-r0drv-linux.o
  58.   CC [M]  /var/lib/dkms/vboxhost/4.3.18/build/vboxdrv/r0drv/linux/thread2-r0drv-linux.o
  59.   CC [M]  /var/lib/dkms/vboxhost/4.3.18/build/vboxdrv/r0drv/linux/threadctxhooks-r0drv-linux.o
  60.   CC [M]  /var/lib/dkms/vboxhost/4.3.18/build/vboxdrv/r0drv/linux/time-r0drv-linux.o
  61.   CC [M]  /var/lib/dkms/vboxhost/4.3.18/build/vboxdrv/r0drv/linux/timer-r0drv-linux.o
  62.   CC [M]  /var/lib/dkms/vboxhost/4.3.18/build/vboxdrv/r0drv/generic/semspinmutex-r0drv-generic.o
  63.   CC [M]  /var/lib/dkms/vboxhost/4.3.18/build/vboxdrv/common/alloc/alloc.o
  64.   CC [M]  /var/lib/dkms/vboxhost/4.3.18/build/vboxdrv/common/checksum/crc32.o
  65.   CC [M]  /var/lib/dkms/vboxhost/4.3.18/build/vboxdrv/common/checksum/ipv4.o
  66.   CC [M]  /var/lib/dkms/vboxhost/4.3.18/build/vboxdrv/common/checksum/ipv6.o
  67.   CC [M]  /var/lib/dkms/vboxhost/4.3.18/build/vboxdrv/common/err/RTErrConvertFromErrno.o
  68.   CC [M]  /var/lib/dkms/vboxhost/4.3.18/build/vboxdrv/common/err/RTErrConvertToErrno.o
  69.   CC [M]  /var/lib/dkms/vboxhost/4.3.18/build/vboxdrv/common/log/log.o
  70.   CC [M]  /var/lib/dkms/vboxhost/4.3.18/build/vboxdrv/common/log/logellipsis.o
  71.   CC [M]  /var/lib/dkms/vboxhost/4.3.18/build/vboxdrv/common/log/logrel.o
  72.   CC [M]  /var/lib/dkms/vboxhost/4.3.18/build/vboxdrv/common/log/logrelellipsis.o
  73.   CC [M]  /var/lib/dkms/vboxhost/4.3.18/build/vboxdrv/common/log/logcom.o
  74.   CC [M]  /var/lib/dkms/vboxhost/4.3.18/build/vboxdrv/common/log/logformat.o
  75.   CC [M]  /var/lib/dkms/vboxhost/4.3.18/build/vboxdrv/common/misc/RTAssertMsg1Weak.o
  76.   CC [M]  /var/lib/dkms/vboxhost/4.3.18/build/vboxdrv/common/misc/RTAssertMsg2.o
  77.   CC [M]  /var/lib/dkms/vboxhost/4.3.18/build/vboxdrv/common/misc/RTAssertMsg2Add.o
  78.   CC [M]  /var/lib/dkms/vboxhost/4.3.18/build/vboxdrv/common/misc/RTAssertMsg2AddWeak.o
  79.   CC [M]  /var/lib/dkms/vboxhost/4.3.18/build/vboxdrv/common/misc/RTAssertMsg2AddWeakV.o
  80.   CC [M]  /var/lib/dkms/vboxhost/4.3.18/build/vboxdrv/common/misc/RTAssertMsg2Weak.o
  81.   CC [M]  /var/lib/dkms/vboxhost/4.3.18/build/vboxdrv/common/misc/RTAssertMsg2WeakV.o
  82.   CC [M]  /var/lib/dkms/vboxhost/4.3.18/build/vboxdrv/common/misc/assert.o
  83.   CC [M]  /var/lib/dkms/vboxhost/4.3.18/build/vboxdrv/common/misc/handletable.o
  84.   CC [M]  /var/lib/dkms/vboxhost/4.3.18/build/vboxdrv/common/misc/handletablectx.o
  85.   CC [M]  /var/lib/dkms/vboxhost/4.3.18/build/vboxdrv/common/misc/thread.o
  86.   CC [M]  /var/lib/dkms/vboxhost/4.3.18/build/vboxdrv/common/string/RTStrCopy.o
  87.   CC [M]  /var/lib/dkms/vboxhost/4.3.18/build/vboxdrv/common/string/RTStrCopyEx.o
  88.   CC [M]  /var/lib/dkms/vboxhost/4.3.18/build/vboxdrv/common/string/RTStrCopyP.o
  89.   CC [M]  /var/lib/dkms/vboxhost/4.3.18/build/vboxdrv/common/string/RTStrNCmp.o
  90.   CC [M]  /var/lib/dkms/vboxhost/4.3.18/build/vboxdrv/common/string/RTStrNLen.o
  91.   CC [M]  /var/lib/dkms/vboxhost/4.3.18/build/vboxdrv/common/string/stringalloc.o
  92.   CC [M]  /var/lib/dkms/vboxhost/4.3.18/build/vboxdrv/common/string/strformat.o
  93.   CC [M]  /var/lib/dkms/vboxhost/4.3.18/build/vboxdrv/common/string/strformatrt.o
  94.   CC [M]  /var/lib/dkms/vboxhost/4.3.18/build/vboxdrv/common/string/strformattype.o
  95.   CC [M]  /var/lib/dkms/vboxhost/4.3.18/build/vboxdrv/common/string/strprintf.o
  96.   CC [M]  /var/lib/dkms/vboxhost/4.3.18/build/vboxdrv/common/string/strtonum.o
  97.   CC [M]  /var/lib/dkms/vboxhost/4.3.18/build/vboxdrv/common/table/avlpv.o
  98.   CC [M]  /var/lib/dkms/vboxhost/4.3.18/build/vboxdrv/common/time/time.o
  99.   CC [M]  /var/lib/dkms/vboxhost/4.3.18/build/vboxdrv/r0drv/linux/RTLogWriteDebugger-r0drv-linux.o
  100.   CC [M]  /var/lib/dkms/vboxhost/4.3.18/build/vboxdrv/generic/RTAssertShouldPanic-generic.o
  101.   CC [M]  /var/lib/dkms/vboxhost/4.3.18/build/vboxdrv/generic/RTLogWriteStdOut-stub-generic.o
  102.   CC [M]  /var/lib/dkms/vboxhost/4.3.18/build/vboxdrv/generic/RTLogWriteStdErr-stub-generic.o
  103.   CC [M]  /var/lib/dkms/vboxhost/4.3.18/build/vboxdrv/generic/RTLogWriteUser-generic.o
  104.   CC [M]  /var/lib/dkms/vboxhost/4.3.18/build/vboxdrv/generic/RTMpGetArraySize-generic.o
  105.   CC [M]  /var/lib/dkms/vboxhost/4.3.18/build/vboxdrv/generic/RTMpGetCoreCount-generic.o
  106.   CC [M]  /var/lib/dkms/vboxhost/4.3.18/build/vboxdrv/generic/RTSemEventWait-2-ex-generic.o
  107.   CC [M]  /var/lib/dkms/vboxhost/4.3.18/build/vboxdrv/generic/RTSemEventWaitNoResume-2-ex-generic.o
  108.   CC [M]  /var/lib/dkms/vboxhost/4.3.18/build/vboxdrv/generic/RTSemEventMultiWait-2-ex-generic.o
  109.   CC [M]  /var/lib/dkms/vboxhost/4.3.18/build/vboxdrv/generic/RTSemEventMultiWaitNoResume-2-ex-generic.o
  110.   CC [M]  /var/lib/dkms/vboxhost/4.3.18/build/vboxdrv/generic/RTTimerCreate-generic.o
  111.   CC [M]  /var/lib/dkms/vboxhost/4.3.18/build/vboxdrv/generic/errvars-generic.o
  112.   CC [M]  /var/lib/dkms/vboxhost/4.3.18/build/vboxdrv/generic/mppresent-generic.o
  113.   CC [M]  /var/lib/dkms/vboxhost/4.3.18/build/vboxdrv/generic/uuid-generic.o
  114.   CC [M]  /var/lib/dkms/vboxhost/4.3.18/build/vboxdrv/VBox/log-vbox.o
  115.   CC [M]  /var/lib/dkms/vboxhost/4.3.18/build/vboxdrv/common/alloc/heapsimple.o
  116.   LD [M]  /var/lib/dkms/vboxhost/4.3.18/build/vboxdrv/vboxdrv.o
  117. make: *** [_module_/var/lib/dkms/vboxhost/4.3.18/build] Error 2
  118. make: Leaving directory `/usr/src/kernels/3.10.0-957.21.3.el7.x86_64'
  119.  
captcha